{"text_format":"1","workbook":"xlsx","n_sheets":8,"sheets":["操作方法","畑の準備","梅雨対策","大雨対策","秋雨対策","図・選択肢","診　断","かん水"],"not_rendered":{"charts":0,"images":22,"macros":1,"external_links":1,"defined_names":54,"comments":0,"pivot_tables":0},"unopened":[],"bounds":{"document_bytes":16777216,"sheet_cells":100000,"rows_first":2000,"rows_last":500,"rows_between":2000,"halvings":0,"cell_chars":16384,"cell_head_chars":4096},"cells_cut":0,"cells_raw":0,"read":"whole","date_system":"1900"}

{"sheet":"操作方法","index":0,"n_rows":106,"n_cols":7,"rows_kept":106,"cut":false,"hidden":false,"merged":[[73,0,86,8],[105,0,106,4],[2,0,6,8],[8,0,30,8],[32,0,41,8],[55,0,60,8],[62,0,71,8]]}
["排水対策診断システムの操作方法",null,null,null,null,null,"京都府南丹農業改良普及センター"]
[]
["　このエクセルシステムは、自分の畑の排水対策の実施状況を、選択肢を選んで入力し、その対策が十分かどうか評価・診断できます。\n　実施する排水対策は、項目ごとに図や説明が表示され、対策技術の学習にも役立ちます。"]
[]
[]
[]
[]
[]
["1　実施対策の入力\n　栽培前の「畑の準備」と栽培中の「梅雨対策」について、それぞれ別のシートで入力・診断できます。\n　まず、「畑の準備」の実施対策の項目（額縁溝、法面下の溝など）のすぐ右横にある〇印をクリックします。図や説明が表示され、下には対策の選択肢があるので、その番号（１～3又は4）を水色の欄に入力します。\n 図は、畑を上から見た図で、その余白に説明・イラストが書かれています。"]
[]
[]
[]
[]
[]
[]
[]
[]
[]
[]
[]
[]
[]
[]
[]
[]
[]
[]
[]
[]
[]
{"$rows_left_out":77}
{"sheet":"畑の準備","index":1,"n_rows":23,"n_cols":24,"rows_kept":23,"cut":false,"hidden":false,"merged":[[6,9,7,9],[8,9,9,9],[6,4,7,5],[8,4,9,5],[6,7,7,7],[8,7,9,7],[6,8,7,8],[8,8,9,8],[2,4,3,6],[4,4,5,5],[4,7,5,7],[4,8,5,8],[4,9,5,9],[10,4,11,5],[12,4,13,5],[14,4,15,5],[16,4,17,5],[18,4,19,5],[16,8,17,8],[18,8,19,8],[10,7,11,7],[12,7,13,7],[14,7,15,7],[16,7,17,7],[18,7,19,7],[17,10,18,10],[21,10,22,10],[5,0,6,1],[9,0,10,1],[13,0,14,1],[17,0,18,1],[3,2,19,2],[2,9,3,9],[10,9,11,9],[12,9,13,9],[14,9,15,9],[16,9,17,9],[18,9,19,9],[10,8,11,8],[12,8,13,8],[14,8,15,8]]}
["排水対策診断システム",null,null,null,null,null,null,"畑の準備",null,null,null,null,null,null,null,null,null,null,null,"京都府南丹農業改良普及センター",null,null,null,250512]
[null,null,null,1," ○をｸﾘｯｸで説明表示、図の下の選択肢番号を水色欄に入力してください",null,null,null,null,null,null,null,null,null,{"$f":"IF(OR($D$2=0,$D$2=9),\"\",$D$2+10)","v":11},{"$f":"IF($O$2<>\"\",VLOOKUP($O$2,$D$5:$E$19,2,0),\"図消去\")","v":"額縁溝"}]
[null,null,null,null,"実施対策\n図･説明の表示○→ｸﾘｯｸ",null,null,"対策内容   図下の番号入力",null,"ポイント"]
[null,null,"畑の準備",null,null,null,null,"↓","1~3又は1~4を入力",null,null,null,null,{"$f":"IF(P2=\"図消去\",\"実施対策の各項目の後ろ ○印 をクリックすると、\",\"\")","v":""}]
[null,null,null,11,"額縁溝",null,null,null,{"$f":"IF(H5=\"\",\"\",VLOOKUP($H5,図・選択肢!$A$29:$C$32,2,0))","v":""},{"$f":"IF(OR(H5=0,H5=\"\"),\"\",VLOOKUP($H5,図・選択肢!$A$28:$C$32,3,0))","v":""}]
[null,null,null,null,null,null,null,null,null,null,null,null,null,{"$f":"IF(P2=\"図消去\",\"実施対策の図や説明、対策内容の選択肢（1～3又は1～4）が表示されます。\",\"\")","v":""}]
[null,null,null,12,"溝・額縁接続",null,null,null,{"$f":"IF(H7=\"\",\"\",VLOOKUP($H7,図・選択肢!$A$50:$C$52,2,0))","v":""},{"$f":"IF(OR(H7=0,H7=\"\"),\"\",VLOOKUP($H7,図・選択肢!$A$49:$C$52,3,0))","v":""}]
[null,null,null,null,null,null,null,null,null,null,null,null,null,{"$f":"IF(P2=\"図消去\",\"図や説明、実施対策の選択肢を全て消したいときは、欄外の ○印 をクリック\",\"\")","v":""}]
[null,null,null,13,"法面下の溝",null,null,null,{"$f":"IF(H9=\"\",\"\",VLOOKUP($H9,図・選択肢!$A$71:$C$74,2,0))","v":""},{"$f":"IF(OR(H9=0,H9=\"\"),\"\",VLOOKUP($H9,図・選択肢!$A$70:$C$74,3,0))","v":""}]
[null,null,null,null,null,null,null,null,null,null,null,null,null,{"$f":"IF(P2=\"図消去\",\"対策内容の番号を入力後、診断コメントを表示したいときは、表右下の水色欄に☑\",\"\")","v":""}]
[null,null,null,14,"排水口の拡大",null,null,null,{"$f":"IF(H11=\"\",\"\",VLOOKUP($H11,図・選択肢!$A$91:$C$93,2,0))","v":""},{"$f":"IF(OR(H11=0,H11=\"\"),\"\",VLOOKUP($H11,図・選択肢!$A$90:$C$93,3,0))","v":""}]
[]
[null,null,null,15,"複数の排水口",null,null,null,{"$f":"IF(H13=\"\",\"\",VLOOKUP($H13,図・選択肢!$A$111:$C$113,2,0))","v":""},{"$f":"IF(OR(H13=0,H13=\"\"),\"\",VLOOKUP($H13,図・選択肢!$A$110:$C$113,3,0))","v":""}]
[]
[null,null,null,16,"長いうねの切断",null,null,null,{"$f":"IF(H15=\"\",\"\",VLOOKUP($H15,図・選択肢!$A$131:$C$133,2,0))","v":""},{"$f":"IF(OR(H15=0,H15=\"\"),\"\",VLOOKUP($H15,図・選択肢!$A$130:$C$133,3,0))","v":""}]
[null,null,null,null,null,null,null,null,null,null,null,{"$f":"IF(OR($P$2=\"図消去\",$D$21=TRUE),\"選択肢消去\",$P$2&\"選択肢\")","v":"額縁溝選択肢"}]
[null,null,null,17,"うね間以外の溝",null,null,null,{"$f":"IF(H17=\"\",\"\",VLOOKUP($H17,図・選択肢!$A$151:$C$153,2,0))","v":""},{"$f":"IF(OR(H17=0,H17=\"\"),\"\",VLOOKUP($H17,図・選択肢!$A$150:$C$153,3,0))","v":""}]
[null,null,null,null,null,null,null,null,null,null,{"$f":"IF($D$21=FALSE,\"診断は\",\"入力に戻るには\")","v":"診断は"}]
[null,null,null,18,"うねの形",null,null,null,{"$f":"IF(H19=\"\",\"\",VLOOKUP($H19,図・選択肢!$A$171:$C$174,2,0))","v":""},{"$f":"IF(OR(H19=0,H19=\"\"),\"\",VLOOKUP($H19,図・選択肢!$A$170:$C$174,3,0))","v":""}]
[null,null,null,null,null,null,null,null,null,null,{"$f":"IF($D$21=FALSE,\"下欄にﾁｪｯｸ\",\"ﾁｪｯｸ 消去\")","v":"下欄にﾁｪｯｸ"}]
[null,null,null,false,"図・説明の消去",null,null,null,"ポイント合計",{"$f":"SUM(J5:J19)","v":0}]
[null,null,null,null,null,null,null,null,"改善が必要",{"$f":"COUNTIF($J$5:$J$20,\"<0\")","v":0},{"$f":"IF(D21=FALSE,\"コメント消去\",\"畑の準備コメント\")","v":"コメント消去"}]
[null,null,null,null,null,null,null,null,"改善の余地あり",{"$f":"COUNTIF($J$5:$J$20,\"00\")","v":0}]

{"sheet":"梅雨対策","index":2,"n_rows":16,"n_cols":20,"rows_kept":16,"cut":false,"hidden":false,"merged":[[2,4,3,6],[17,0,18,1],[9,10,10,10],[10,9,11,9],[13,0,14,1],[5,0,6,1],[9,0,10,1],[13,10,14,10],[3,2,11,2],[4,4,5,5],[6,4,7,5],[8,4,9,5],[10,4,11,5],[4,7,5,7],[6,7,7,7],[10,8,11,8],[4,9,5,9],[6,9,7,9],[8,9,9,9],[10,7,11,7],[2,9,3,9],[4,8,5,8],[6,8,7,8],[8,8,9,8],[8,7,9,7]]}
["排水対策診断システム",null,null,null,null,null,null,"梅雨対策",null,null,null,null,null,null,null,null,null,null,null,"京都府南丹農業改良普及センター"]
[null,null,null,1," ○をｸﾘｯｸで説明表示、図の下の選択肢番号を水色欄に入力してください",null,null,null,null,null,null,null,null,null,{"$f":"IF(OR($D$2=0,$D$2=5),\"\",$D$2+20)","v":21},{"$f":"IF($O$2<>\"\",VLOOKUP($O$2,$D$5:$E$11,2,0),\"梅雨図消去\")","v":"水たまり観察"}]
[null,null,null,null,"実施対策\n図･説明の表示○→ｸﾘｯｸ",null,null,"対策内容   図下の番号入力",null,"ポイント"]
[null,null,"梅雨対策",null,null,null,null,"↓","1~3又は1~4を入力",null,null,null,null,{"$f":"IF(P2=\"梅雨図消去\",\"実施対策の各項目の後ろ ○印 をクリックすると、\",\"\")","v":""}]
[null,null,null,21,"水たまり観察",null,null,null,{"$f":"IF(梅雨対策!H5=\"\",\"\",VLOOKUP(梅雨対策!$H5,図・選択肢!$A$205:$C$208,2,0))","v":""},{"$f":"IF(OR(H5=0,H5=\"\"),\"\",VLOOKUP(梅雨対策!$H5,図・選択肢!$A$205:$C$208,3,0))","v":""}]
[null,null,null,null,null,null,null,null,null,null,null,null,null,{"$f":"IF(P2=\"梅雨図消去\",\"実施対策の図や説明、対策内容の選択肢（1～3又は1～4）が表示されます。\",\"\")","v":""}]
[null,null,null,22,"溝の修復",null,null,null,{"$f":"IF(梅雨対策!H7=\"\",\"\",VLOOKUP(梅雨対策!$H7,図・選択肢!$A$225:$C$228,2,0))","v":""},{"$f":"IF(OR(H7=0,H7=\"\"),\"\",VLOOKUP(梅雨対策!$H7,図・選択肢!$A$225:$C$228,3,0))","v":""}]
[null,null,null,null,null,null,null,null,null,null,null,null,null,{"$f":"IF(P2=\"梅雨図消去\",\"図や説明、実施対策の選択肢を全て消したいときは、欄外の ○印 をクリック\",\"\")","v":""}]
[null,null,null,23,"溝さらえ",null,null,null,{"$f":"IF(梅雨対策!H9=\"\",\"\",VLOOKUP(梅雨対策!$H9,図・選択肢!$A$245:$C$248,2,0))","v":""},{"$f":"IF(OR(H9=0,H9=\"\"),\"\",VLOOKUP(梅雨対策!$H9,図・選択肢!$A$245:$C$248,3,0))","v":""}]
[null,null,null,null,null,null,null,null,null,null,{"$f":"IF($D$13=FALSE,\"診断は\",\"入力に戻るには\")","v":"診断は"},null,null,{"$f":"IF(P2=\"梅雨図消去\",\"対策内容の番号を入力後、診断コメントを表示したいときは、表右下の水色欄に☑\",\"\")","v":""}]
[null,null,null,24,"土寄せ・高うね",null,null,null,{"$f":"IF(梅雨対策!H11=\"\",\"\",VLOOKUP(梅雨対策!$H11,図・選択肢!$A$265:$C$268,2,0))","v":""},{"$f":"IF(OR(H11=0,H11=\"\"),\"\",VLOOKUP(梅雨対策!$H11,図・選択肢!$A$265:$C$268,3,0))","v":""}]
[null,null,null,null,null,null,null,null,null,null,{"$f":"IF($D$13=FALSE,\"下欄にﾁｪｯｸ\",\"ﾁｪｯｸ 消去\")","v":"下欄にﾁｪｯｸ"}]
["",null,null,false,"図・説明の消去",null,null,null,"ポイント合計",{"$f":"SUM(J5:J12)","v":0}]
[null,null,null,null,null,null,null,null,"改善が必要",{"$f":"COUNTIF($J$5:$J$12,\"<0\")","v":0},{"$f":"IF(D13=FALSE,\"梅雨コメント消去\",\"梅雨コメント\")","v":"梅雨コメント消去"}]
[null,null,null,null,null,null,null,null,"改善の余地あり",{"$f":"COUNTIF($J$5:$J$12,\"00\")","v":0}]
[null,null,null,null,null,null,null,null,null,null,null,{"$f":"IF(OR($P$2=\"梅雨図消去\",$D$13=TRUE),\"梅雨選択肢消去\",$P$2&\"選択肢\")","v":"水たまり観察選択肢"}]

{"sheet":"大雨対策","index":3,"n_rows":47,"n_cols":29,"rows_kept":47,"cut":false,"hidden":false,"merged":[[25,11,25,13],[25,14,25,16],[25,17,25,19],[26,11,26,13],[26,14,26,16],[26,17,26,19],[2,9,3,9],[4,7,5,7],[4,8,5,8],[17,0,18,1],[11,11,11,13],[12,11,12,13],[13,0,14,1],[8,4,9,6],[3,2,9,2],[5,0,6,1],[6,7,7,7],[8,7,9,7],[9,0,10,1],[2,4,3,6],[4,9,5,9],[4,4,5,6],[6,4,7,6],[11,17,11,19],[12,17,12,19],[6,8,7,8],[6,9,7,9],[8,8,9,8],[8,9,9,9],[11,14,11,16],[12,14,12,16]]}
["排水対策診断システム",null,null,null,null,null,null,"大雨対策",null,null,null,null,null,"実施したら図の下の水色欄に☑",null,null,null,"京都府南丹農業改良普及センター"]
[null,null,null,1," 大雨前に対策しましょう。入力は右の図の中",null,null,null,null,null,null,"排水溝のメンテナンス"]
[null,null,null,null,"実施対策内容",null,null,"実施対策数",null,"ポイント"]
[null,null,"大雨対策",null,null,null,null,"↓","実施した内容"]
[null,null,null,31,{"$f":"L2","v":"排水溝のメンテナンス"},null,null,{"$f":"COUNTIF(X11:X13,TRUE)","v":0},{"$f":"Z14","v":""},{"$f":"IF(AA14<>0,AA14,\"\")","v":""}]
[]
[null,null,null,32,{"$f":"L16","v":"排水口の改善"},null,null,{"$f":"COUNTIF(X21:X23,TRUE)","v":0},{"$f":"Z24","v":""},{"$f":"IF(AA24<>0,AA24,\"\")","v":""}]
[]
[null,null,null,33,{"$f":"L30","v":"「畑の準備」で改善、改善余地ある事項"},null,null,{"$f":"COUNTIF(X31:X45,TRUE)","v":0},{"$f":"Z46","v":""},{"$f":"IF(AA46<>0,AA46,\"\")","v":""}]
[null,null,null,null,null,null,null,null,null,null,null,null,null,null,null,null,null,null,null,null,null,null,null,null,null,"TRUE項目","溝メンテP","配点"]
[null,null,null,false,{"$f":"IF($D$11=FALSE,\"診断は下欄にﾁｪｯｸ\",\"ﾁｪｯｸ消去で診断非表示\")","v":"診断は下欄にﾁｪｯｸ"},null,null,null,"ポイント合計",{"$f":"SUM(J5:J10)","v":0},null,null,null,null,null,null,null,null,null,null,null,null,null,false,"溝さらえ　",{"$f":"IF(X11=TRUE,Y11,\"\")","v":""},{"$f":"IF(X11=TRUE,AB11,0)","v":0},5]
[null,null,null,{"$f":"IF(D11=FALSE,\"消去大雨コメント\",\"大雨コメント\")","v":"消去大雨コメント"},null,null,null,null,"実施対策数",{"$f":"SUM(H5:H10)","v":0},null,"流れ悪い部分の修復",null,null,"溝の交点を広く",null,null,"排水口近くの溝幅を広く",null,null,null,null,null,false,"溝交点　",{"$f":"IF(X12=TRUE,Y12,\"\")","v":""},{"$f":"IF(X12=TRUE,AB12,0)","v":0},3]
["",null,null,null,null,null,null,null,null,null,null,"（溝さらえ、除草）",null,null,"（特に排水口付近）",null,null,"（排水口前は深く）",null,null,null,null,null,false,"溝幅拡張　","",0,5]
[null,null,null,null,null,null,null,null,null,null,null,null,null,null,null,null,null,null,null,null,null,null,null,null,null,{"$f":"Z11&Z12&Z13","v":""},{"$f":"SUM(AA11:AA13)","v":0}]
[]
[null,null,null,null,null,null,null,null,null,null,null,"排水口の改善"]
[]
[]
[]
[null,null,null,null,null,null,null,null,null,null,null,null,null,null,null,null,null,null,null,null,null,null,null,null,null,null,"排水口改善P","配点"]
[null,null,null,null,null,null,null,null,null,null,null,null,null,null,null,null,null,null,null,null,null,null,null,false,"排水口拡幅　",{"$f":"IF(X21=TRUE,Y21,\"\")","v":""},{"$f":"IF(X21=TRUE,AB21,0)","v":0},5]
[null,null,null,null,null,null,null,null,null,null,null,null,null,null,null,null,null,null,null,null,null,null,null,false,"排水口増設　","",0,5]
[null,null,null,null,null,null,null,null,null,null,null,null,null,null,null,null,null,null,null,null,null,null,null,false,"入水口越水防止　","",0,3]
[null,null,null,null,null,null,null,null,null,null,null,null,null,null,null,null,null,null,null,null,null,null,null,null,null,{"$f":"Z21&Z22&Z23","v":""},{"$f":"SUM(AA21:AA23)","v":0}]
[]
[null,null,null,null,null,null,null,null,null,null,null,"排水口の拡幅",null,null,"複数の排水口を設置",null,null,"入水口の越水防止"]
[null,null,null,null,null,null,null,null,null,null,null,"（幅広く、深く）",null,null,"（排水口増設）",null,null,"（水路増水時も入らないよう）"]
[]
[]
[null,null,null,null,null,null,null,null,null,null,null,"「畑の準備」で改善、改善余地ある事項",null,null,null,null,null,null,null,null,null,null,null,null,null,null,"準備→改善P","配点","未改善事項"]
{"$rows_left_out":18}
{"sheet":"秋雨対策","index":4,"n_rows":17,"n_cols":8,"rows_kept":17,"cut":false,"hidden":true,"merged":[]}
[null,"排水対策支援システム",null,null,"秋雨対策"]
[]
[null,null,"No","実施対策",null,"対策内容 番号選択",null,"Ｐ"]
[4,"秋雨対策",41,"滞水部分観察",null,1,{"$f":"IF(F4=\"\",\"\",VLOOKUP($F4,畑の準備!$AA$24:$AC$28,2,0))","v":{"$error":"#N/A"}},{"$f":"VLOOKUP($F4,畑の準備!$AA$24:$AC$28,3,0)","v":{"$error":"#N/A"}}]
[null,null,42,"溝崩れ補修",null,1,{"$f":"IF(F5=\"\",\"\",VLOOKUP($F5,畑の準備!$AE$24:$AG$28,2,0))","v":{"$error":"#N/A"}},{"$f":"VLOOKUP($F5,畑の準備!$AE$24:$AG$28,3,0)","v":{"$error":"#N/A"}}]
[null,null,43,"溝さらえ",null,2,{"$f":"IF(F6=\"\",\"\",VLOOKUP($F6,畑の準備!$AI$24:$AK$28,2,0))","v":{"$error":"#N/A"}},{"$f":"VLOOKUP($F6,畑の準備!$AI$24:$AK$28,3,0)","v":{"$error":"#N/A"}}]
[null,null,44,"溝・うね間の除草",null,3,{"$f":"IF(F7=\"\",\"\",VLOOKUP($F7,畑の準備!$AM$24:$AO$28,2,0))","v":{"$error":"#N/A"}},{"$f":"VLOOKUP($F7,畑の準備!$AM$24:$AO$28,3,0)","v":{"$error":"#N/A"}}]
[null,null,null,null,null,null,"Ｐ計",{"$f":"SUM(H4:H7)","v":{"$error":"#N/A"}}]
[]
[]
[]
[]
[]
[null,"秋雨対策"]
[]
[]
[null,"未完成です"]

{"sheet":"図・選択肢","index":5,"n_rows":269,"n_cols":20,"rows_kept":269,"cut":false,"hidden":true,"merged":[[117,7,126,9],[77,8,86,11],[90,9,93,10],[90,11,93,12],[90,14,93,17],[110,6,111,8],[110,9,113,10],[110,11,113,12],[110,14,113,17],[90,6,93,8],[97,7,106,11],[36,9,45,13],[32,9,32,12],[15,7,24,10],[49,9,52,10],[49,12,52,13],[28,9,31,10],[28,11,31,12],[20,13,24,14],[28,13,31,15],[70,14,73,17],[57,12,58,14],[57,7,66,11],[70,9,73,10],[70,6,71,8],[70,11,73,12],[142,7,146,13],[150,6,152,8],[150,10,153,11],[150,13,153,15],[130,9,133,10],[130,11,133,12],[130,6,132,8],[204,11,207,12],[204,13,207,15],[170,9,173,10],[170,11,173,12],[170,6,173,8],[170,13,173,15],[164,8,165,9],[164,12,165,14],[264,6,267,8],[264,9,267,10],[264,11,267,12],[264,13,267,15],[224,6,227,8],[224,9,227,10],[224,11,227,12],[224,13,227,15],[244,6,247,8],[244,9,247,10],[244,11,247,12],[244,13,247,15],[204,6,207,8],[204,9,207,10]]}
[null,null,null,"$E$1:$R$12 の空白は　図、"]
[null,null,null,"文字の消去に使用中 → → →"]
["畑の準備"]
[11,"額縁溝",null,null,null,null,null,null,null,null,null,null,null,null,null,null,null,null,21,"滞水部分観察"]
[12,"溝・額縁接続",null,null,null,null,null,null,null,null,null,null,null,null,null,null,null,null,22,"溝崩れ補修"]
[13,"法面下の溝",null,null,null,null,null,null,null,null,null,null,null,null,null,null,null,null,23,"溝さらえ"]
[14,"排水口の拡大",null,null,null,null,null,null,null,null,null,null,null,null,null,null,null,null,24,"土寄せ・高うね"]
[15,"複数の排水口"]
[16,"長いうねの切断"]
[17,"うね間以外の溝"]
[18,"うねの形"]
[]
[null,null,null,null,{"$f":"B4","v":"額縁溝"},null,null,null,null,"額縁溝は、外周を溝でつなぐ"]
[]
[]
[null,null,null,null,null,null,null,"　額縁溝は排水の基本\n　畑の内側の水を排出し、\n　外部からの浸水を防ぐ。\n　溝は広く、他の溝、う\n　ね間と確実につなぐ。"]
[]
[]
[]
[]
[null,null,null,null,null,null,null,null,null,null,null,null,null,"溝をつける際\nに崩れた土は\nきちんと取り\n除く"]
[null,null,null,null,"排水口"]
[null,null,null,null,"←←←"]
[]
[]
[]
[11,{"$f":"B4","v":"額縁溝"}]
[0,"説明",null,null,{"$f":"E13&\"選択肢\"","v":"額縁溝選択肢"},null,"１　なし",null,null,"２　片培土",null,"３　谷上げ",null,"４　溝掘り機"]
[1,"なし",-10,null,{"$f":"IF(畑の準備!$P$2=\"図消去\",\"選択肢消去\",畑の準備!$P$2)","v":"額縁溝"},null,"うねたてのみで",null,null,"機械に片培土板を\n着けて額縁溝つけ",null,"谷上げの培土板を\n着けて、しっかり\n額縁溝つけ",null,"溝掘り専用機を使用して、深くてしっかりした額縁溝つけ"]
[2,"片培土",0,null,null,null,"額縁溝はなし"]
{"$rows_left_out":240}
{"sheet":"診　断","index":6,"n_rows":161,"n_cols":33,"rows_kept":161,"cut":false,"hidden":true,"merged":[[124,20,125,30],[128,20,129,30],[132,20,133,30],[121,4,122,5],[121,6,122,8],[121,9,122,10],[121,11,122,11],[121,16,122,17],[129,5,143,12],[6,20,7,29],[10,20,11,29],[14,20,15,29],[27,5,30,16],[25,4,26,5],[25,6,26,8],[25,9,26,10],[25,12,26,15],[25,16,26,17],[25,11,26,11],[83,12,84,17],[83,5,84,10],[83,4,84,4],[83,11,84,11],[31,5,43,16],[66,4,67,5],[66,6,67,8],[66,9,67,10],[70,20,71,30],[74,20,75,30],[78,20,79,30],[66,11,67,11],[66,12,67,15],[66,16,67,17],[68,5,72,16],[73,5,82,16],[146,4,147,4],[121,12,122,13],[123,5,128,12],[144,4,145,4],[144,5,145,9],[144,11,145,13],[146,11,147,13],[144,10,145,10],[146,10,147,10],[146,5,147,9]]}
["診　断",null,null,null,null,null,null,null,null,null,null,null,null,null,null,null,null,null,null,"畑の準備",null,11,12,13,14,15,16,17,18]
[null,null,null,1,null,null,null,null,null,null,null,null,null,null,null,null,null,null,null,"ポイント",{"$f":"IF(COUNTA(畑の準備!H5:H20)=0,\"まだ入力されてません\",IF(ポイント<=10,U7,IF(ポイント>=21,U15,U11)))","v":"まだ入力されてません"},{"$f":"畑の準備!J5","v":""},{"$f":"畑の準備!J7","v":""},{"$f":"畑の準備!J9","v":""},{"$f":"畑の準備!J11","v":""},{"$f":"畑の準備!J13","v":""},{"$f":"畑の準備!J15","v":""},{"$f":"畑の準備!J17","v":""},{"$f":"畑の準備!J19","v":""}]
[null,null,null,null,null,null,null,null,null,null,null,null,null,null,null,null,null,null,null,"改善必要",{"$f":"V3&W3&X3&Y3&Z3&AA3&AB3&AC3","v":""},{"$f":"IF(畑の準備!J5<0,U19&CHAR(10),\"\")","v":""},{"$f":"IF(畑の準備!J7<0,U22&CHAR(10),\"\")","v":""},{"$f":"IF(畑の準備!J9<0,U25&CHAR(10),\"\")","v":""},null,null,null,null,{"$f":"IF(畑の準備!J19<0,U28&CHAR(10),\"\")","v":""}]
[null,null,null,null,null,null,null,null,null,null,null,null,null,null,null,null,null,null,null,"改善余地",{"$f":"V4&W4&X4&Y4&Z4&AA4&AB4&AC4","v":""},{"$f":"IF(畑の準備!J5=0,U33,\"\")","v":""},null,{"$f":"IF(畑の準備!J9=0,U36,\"\")","v":""},{"$f":"IF(畑の準備!J11=0,U39,\"\")","v":""},{"$f":"IF(畑の準備!J13=0,U42,\"\")","v":""},{"$f":"IF(畑の準備!J15=0,U45,\"\")","v":""},{"$f":"IF(畑の準備!J17=0,U48,\"\")","v":""},{"$f":"IF(畑の準備!J19=0,U51,\"\")","v":""}]
[null,null,null,null,"↓  $E$6:$R$24 はコメント消去のための空白"]
[null,null,null,"コメント消去",null,null,null,null,null,null,null,null,null,null,null,null,null,null,null,null,"10以下","排水対策が不十分"]
[null,null,null,null,null,null,null,null,null,null,null,null,null,null,null,null,null,null,null,null,"　排水対策は不十分です。排水が特に良い畑ならば大丈夫かもしれませんが、溝の設置や排水口などそれぞれの項目を見直し、可能な対策は今からでも実施してください。"]
[]
["改善が必要　のコメント"]
[null,null,null,null,null,null,null,null,null,null,null,null,null,null,null,null,null,null,null,null,"10～20","排水対策改善の余地あり"]
[null,null,null,null,null,null,null,null,null,null,null,null,null,null,null,null,null,null,null,null,"　一般的な排水対策は実施されていますが、排水不良部分がある場合は不十分かもしれません。常に湿気る部分、雨で水がたまる部分には積極的に対策を行い、雨の時期に備えましょう。"]
[]
[]
[null,null,null,null,null,null,null,null,null,null,null,null,null,null,null,null,null,null,null,null,"21以上","基本的な排水対策はできている"]
[null,null,null,null,null,null,null,null,null,null,null,null,null,null,null,null,null,null,null,null,"　排水対策はいろいろ実施されています。これで油断せぬよう観察を欠かさずに、溝や排水口をメンテナンスし、予想外の排水不良が起こらないよう、対処してください。"]
[]
[]
["保護　のパスワード",null,null,null,null,null,null,null,null,null,null,null,null,null,null,null,null,null,null,null,"額縁マイナス"]
["y-tanaka",null,null,null,null,null,null,null,null,null,null,null,null,null,null,null,null,null,null,null,"　額縁溝は基本。外周を完全につなぎ、排水口まで水が流れるようにします。"]
[]
[null,null,null,null,null,null,null,null,null,null,null,null,null,null,null,null,null,null,null,null,"溝額縁接続"]
[null,null,null,null,null,null,null,null,null,null,null,null,null,null,null,null,null,null,null,null,"　溝をつけたつもりでも、溝の交点は後からつけた培土板の土でふさがります。溝の末端とともに、クワで手直ししてつなぎます。"]
[]
[null,null,null,null,null,null,null,null,null,null,null,null,null,null,null,null,null,null,null,null,"法面下溝"]
[null,null,null,null,null,null,null,null,null,null,null,null,null,null,null,null,null,null,null,null,"　法面下は、地下水や上の水田の水がしみ出し、水がたまります。深めの溝を掘り、しみ出す水を遮断します。"]
[null,null,null,"畑の準備コメント","ポイント",null,{"$f":"畑の準備!J21","v":0},null,null,"改善が必要な項目",null,{"$f":"畑の準備!J22","v":0},"改善の余地がある項目",null,null,null,{"$f":"畑の準備!J23","v":0}]
[null,null,null,null,null,null,null,null,null,null,null,null,null,null,null,null,null,null,null,null,"うねへこみ"]
[null,null,null,null,null,{"$f":"U2","v":"まだ入力されてません"},null,null,null,null,null,null,null,null,null,null,null,null,null,null,"　培土板でうね立てすると、肩部分の土が盛り上がり中央がへこみます。数日たってへこむこともあるので、必ずクワで整形します。"]
[]
[]
{"$rows_left_out":132}
{"sheet":"かん水","index":7,"n_rows":23,"n_cols":29,"rows_kept":23,"cut":false,"hidden":true,"merged":[]}
[]
[null,"かん水支援システム"]
[null,null,"No","時　期",null,"畑・天候の状況",null,"Ｐ",null,null,null,null,null,null,null,null,null,null,null,null,"Ｐ",null,null,null,"Ｐ",null,null,null,"Ｐ"]
[null,"直播・移植期",11,"うね立時水分",null,2,{"$f":"IF(F4=\"\",\"\",VLOOKUP($F4,$S$4:$U$7,2,0))","v":"乾燥"},{"$f":"VLOOKUP($F4,$S$4:$U$7,3,0)","v":0},null,null,null,null,null,null,null,null,null,11,0,"説明",0,12,0,"説明",0,13,0,"説明",0]
[null,null,12,"直播・移植後",null,1,{"$f":"IF(F5=\"\",\"\",VLOOKUP($F5,$W$4:$Y$7,2,0))","v":"移植後無かん水"},{"$f":"VLOOKUP($F5,$W$4:$Y$7,3,0)","v":-3},null,null,null,null,null,null,null,null,null,null,1,"過湿",-5,null,1,"移植後無かん水",-3,null,1,"見ていない",-5]
[null,null,13,"初期生育期",null,3,{"$f":"IF(F6=\"\",\"\",VLOOKUP($F6,$AA$4:$AC$8,2,0))","v":"1週間雨なし"},{"$f":"VLOOKUP($F6,$AA$4:$AC$8,3,0)","v":2},null,null,null,null,null,null,null,null,null,null,2,"乾燥",0,null,2,"乾いたうね直播",3,null,2,"苗立不揃い",0]
[null,null,null,null,null,null,"Ｐ計",{"$f":"SUM(H4:H6)","v":-1},null,null,null,null,null,null,null,null,null,null,3,"適湿",5,null,3,"発芽･活着問題なし",5,null,3,"1週間雨なし",2]
[null,null,null,null,null,null,null,null,null,null,null,null,null,null,null,null,null,null,4,null,null,null,4,null,null,null,4,"適度な雨",7]
[null,"梅雨期",21,"梅雨前半",null,1,{"$f":"IF(F9=\"\",\"\",VLOOKUP($F9,$S$9:$U$12,2,0))","v":"うね間も乾燥"},{"$f":"VLOOKUP($F9,$S$9:$U$12,3,0)","v":-2},null,null,null,null,null,null,null,null,null,21,0,"説明",0,22,0,"説明",0]
[null,null,22,"梅雨後半",null,1,{"$f":"IF(F10=\"\",\"\",VLOOKUP($F10,$W$9:$Y$12,2,0))","v":"カラ梅雨・少雨"},{"$f":"VLOOKUP($F10,$W$9:$Y$12,3,0)","v":0},null,null,null,null,null,null,null,null,null,null,1,"うね間も乾燥",-2,null,1,"カラ梅雨・少雨",0]
[null,null,null,null,null,null,null,null,null,null,null,null,null,null,null,null,null,null,2,"著しい少雨",0,null,2,"乾燥と大雨の激変",2]
[null,"夏 着莢機",31,"梅雨明け10日",null,1,{"$f":"IF(F12=\"\",\"\",VLOOKUP($F12,$S$14:$U$18,2,0))","v":"10日以上雨なし"},{"$f":"VLOOKUP($F12,$S$14:$U$18,3,0)","v":-3},null,null,null,null,null,null,null,null,null,null,3,"適度な雨",5,null,3,"適度な雨",7]
[null,null,32,"開花初期(8/上)",null,1,{"$f":"IF(F13=\"\",\"\",VLOOKUP($F13,$W$14:$Y$18,2,0))","v":"雨なく高温乾燥"},{"$f":"VLOOKUP($F13,$W$14:$Y$18,3,0)","v":-3},null,null,null,null,null,null,null,null,null,null,4,null,null,null,4]
[null,null,33,"盛夏(8/中-8/下)",null,2,{"$f":"IF(F14=\"\",\"\",VLOOKUP($F14,$AA$14:$AC$18,2,0))","v":"高温･少雨"},{"$f":"VLOOKUP($F14,$AA$14:$AC$18,3,0)","v":0},null,null,null,null,null,null,null,null,null,31,0,"説明",0,32,0,"説明",0,33,0,"説明",0]
[null,null,null,null,null,null,null,null,null,null,null,null,null,null,null,null,null,null,1,"10日以上雨なし",-3,null,1,"雨なく高温乾燥",-3,null,1,"乾ききった時期あり",-5]
[null,"秋 莢肥大期",41,"9/上旬 莢伸長期",null,null,null,null,null,null,null,null,null,null,null,null,null,null,2,"小雨あったが乾燥",0,null,2,"梅雨明け後小雨のみ",0,null,2,"高温･少雨",0]
[null,null,42,"9/中下旬 粒肥大期",null,null,null,null,null,null,null,null,null,null,null,null,null,null,3,"5日程度で雨",2,null,3,"雨･乾燥ともあり",5,null,3,"雨･乾燥ともあり",5]
[null,null,43,"10月 粒充実期",null,null,null,null,null,null,null,null,null,null,null,null,null,null,4,"5日以内にかん水",5,null,4,"乾かず適度な雨",7,null,4,"乾かず適度な雨",7]
[null,null,null,null,null,null,null,null,null,null,null,null,null,null,null,null,null,41,0,"説明",0,32,0,"説明",null,33,0,"説明",0]
[null,null,null,null,null,null,null,null,null,null,null,null,null,null,null,null,null,null,1,"高温乾燥の継続",-3,null,1,"少雨で夏並み高温",-3,null,1,"雨なく夏並み高温",-3]
[null,null,null,null,null,null,null,null,null,null,null,null,null,null,null,null,null,null,2,"少雨・土は白い",0,null,2,"雨間隔7日以上",0,null,2,"雨間隔10日以上",0]
[null,null,null,null,null,null,null,null,null,null,null,null,null,null,null,null,null,null,3,"雨間隔1週間",3,null,3,"乾かず適度な雨",5,null,3,"乾かず適度な雨",5]
[null,null,null,null,null,null,null,null,null,null,null,null,null,null,null,null,null,null,4,"乾かず適度な雨",7,null,4,null,null,null,4]